{"text_format":"1","workbook":"xlsx","n_sheets":14,"sheets":["DHCS Only","1. Information","2. Component Summary","3. CSS","4. PEI","5. INN","6. WET","7. CFTN","8. Adjustment (MHSA)","9. Adjustment (FFP)","10. Comments","Checks","drop down fields","E-1 CountyState2017"],"not_rendered":{"charts":0,"images":0,"macros":1,"external_links":2,"defined_names":41,"comments":1,"pivot_tables":0},"unopened":[],"bounds":{"document_bytes":16777216,"sheet_cells":100000,"rows_first":2000,"rows_last":500,"rows_between":2000,"halvings":0,"cell_chars":16384,"cell_head_chars":4096},"cells_cut":0,"cells_raw":0,"read":"whole","date_system":"1900"}

{"sheet":"DHCS Only","index":0,"n_rows":3,"n_cols":1,"rows_kept":3,"cut":false,"hidden":true,"merged":[]}
["For DHCS use only."]
["Click button to lock or unlock all sheets for editing. "]
["This tab should be hidden when not in use. "]

{"sheet":"1. Information","index":1,"n_rows":20,"n_cols":5,"rows_kept":20,"cut":false,"hidden":false,"merged":[]}
[null,"STATE OF CALIFORNIA",null,null,"Department of Health Care Services"]
[null,"HEALTH AND HUMAN SERVICES AGENCY"]
[]
[null,"DHCS 1822 A (Rev. 10/18)"]
[null,"Annual Mental Health Services Act Revenue and Expenditure Report"]
[null,{"$f":"\"Fiscal Year: \"&D10","v":"Fiscal Year: 2022-23"}]
[null,"Information"]
[]
[null,1,"Date:","2024-03-07"]
[null,2,"RER Fiscal Year (20YY-YY):","2022-23"]
[null,3,"County:","San Benito"]
[null,4,"County Code:",{"$f":"IF(ISBLANK(D11),\"\",VLOOKUP(D11,Info_County_Code,2))","v":35}]
[null,5,"Address:","1131 Community Parkway"]
[null,6,"City:","Hollister, CA"]
[null,7,"Zip:",95023]
[null,8,"County Population:  Over 200,000? (Yes or No)",{"$f":"IF(ISBLANK(D11),\"\",VLOOKUP(D11,County_Population,5,FALSE))","v":"No"}]
[null,9,"Name of Preparer:","Sandra Urbina"]
[null,10,"Title of Preparer:","Accountant III"]
[null,11,"Preparer Contact Email:","saurbina@sbcmh.org"]
[null,12,"Preparer Contact Telephone","(831)836-4020"]
{"$rows_left_out":1}
{"sheet":"2. Component Summary","index":2,"n_rows":46,"n_cols":10,"rows_kept":46,"cut":false,"hidden":false,"merged":[]}
[null,"STATE OF CALIFORNIA",null,null,null,null,null,null,"Department of Health Care Services"]
[null,"HEALTH AND HUMAN SERVICES AGENCY"]
[]
[null,"DHCS 1822 B (Rev. 10/18)"]
[null,{"$f":"'1. Information'!B5","v":"Annual Mental Health Services Act Revenue and Expenditure Report"}]
[null,{"$f":"'1. Information'!B6","v":"Fiscal Year: 2022-23"}]
[null,"Component Summary "]
[]
[null,"County:",{"$f":"IF(ISBLANK('1. Information'!D11),\"\",'1. Information'!D11)","v":"San Benito"},null,null,"Date:",{"$f":"IF(ISBLANK('1. Information'!D9),\"\",'1. Information'!D9)","v":"2024-03-07"}]
[]
[]
[null,null,null,"A","B","C","D","E","F"]
[null,"SECTION 1: Interest",null,"CSS","PEI","INN","WET","CFTN","TOTAL"]
[null,1,"Component Interest Earned",{"$f":"231207.69+20601.18","v":251808.87},57801.919999999998,15211.03,3647.66,29509.64,{"$f":"SUM(D14:H14)","v":357979.12}]
[null,2,"Joint Powers Authority Interest Earned",null,null,null,null,null,{"$f":"SUM(D15:H15)","v":0}]
[]
[null,null,null,"A","B","C"]
[null,"SECTION 2: Prudent Reserve",null,"CSS","PEI","TOTAL"]
[null,3,"Local Prudent Reserve Beginning Balance",null,null,790759]
[null,4,"Transfer from Local Prudent Reserve",null,null,{"$f":"-D20-E20","v":0}]
{"$rows_left_out":27}
{"sheet":"3. CSS","index":3,"n_rows":133,"n_cols":12,"rows_kept":133,"cut":false,"hidden":false,"merged":[]}
[null,"STATE OF CALIFORNIA",null,null,null,null,null,null,null,null,null,"Department of Health Care Services"]
[null,"HEALTH AND HUMAN SERVICES AGENCY"]
[]
[null,"DHCS 1822 C (Rev. 10/18)"]
[null,{"$f":"'1. Information'!B5","v":"Annual Mental Health Services Act Revenue and Expenditure Report"}]
[null,{"$f":"'1. Information'!B6","v":"Fiscal Year: 2022-23"}]
[null,"Community Services and Supports (CSS) Summary  "]
[]
[null,"County:",null,{"$f":"IF(ISBLANK('1. Information'!D11),\"\",'1. Information'!D11)","v":"San Benito"},null,"Date:",{"$f":"IF(ISBLANK('1. Information'!D9),\"\",'1. Information'!D9)","v":"2024-03-07"}]
[]
[null,"SECTION ONE"]
[]
[null,null,null,null,null,"A","B","C","D","E","F"]
[null,null,null,null,null,"Total MHSA (Including Interest)","Medi-Cal FFP","1991 Realignment","Behavioral Health Subaccount","Other","Grand Total"]
[null,1,"CSS Annual Planning Costs",null,null,6424,0,0,0,0,{"$f":"SUM(F15:J15)","v":6424}]
[null,2,"CSS Evaluation Costs",null,null,2816,0,0,0,0,{"$f":"SUM(F16:J16)","v":2816}]
[null,3,"CSS Administration Costs",null,null,165448.93,344492.49,159742.44,0,0,669683.86]
[null,4,"CSS Funds Transferred to JPA",null,null,null,null,null,null,null,0]
[null,5,"CSS Expenditure Incurred by JPA",null,null,null,null,null,null,null,0]
[null,6,"CSS Funds Transferred to CalHFA",null,null,null,null,null,null,null,0]
{"$rows_left_out":114}
{"sheet":"4. PEI","index":4,"n_rows":133,"n_cols":20,"rows_kept":133,"cut":false,"hidden":false,"merged":[]}
[null,"STATE OF CALIFORNIA",null,null,null,null,null,null,null,null,null,null,null,null,null,null,"Department of Health Care Services"]
[null,"HEALTH AND HUMAN SERVICES AGENCY"]
[]
[null,"DHCS 1822 D (Rev. 10/18)"]
[null,{"$f":"'1. Information'!B5","v":"Annual Mental Health Services Act Revenue and Expenditure Report"}]
[null,{"$f":"'1. Information'!B6","v":"Fiscal Year: 2022-23"}]
[null,"Prevention and Early Intervention (PEI) Summary"]
[]
[null,"County:",null,{"$f":"IF(ISBLANK('1. Information'!D11),\"\",'1. Information'!D11)","v":"San Benito"},null,"Date:",{"$f":"IF(ISBLANK('1. Information'!D9),\"\",'1. Information'!D9)","v":"2024-03-07"}]
[]
[null,"SECTION ONE"]
[]
[null,null,null,null,null,"A","B","C","D","E","F"]
[null,null,null,null,null,"Total MHSA (Including Interest)","Medi-Cal FFP","1991 Realignment","Behavioral Health Subaccount","Other","Grand Total"]
[null,1,"PEI Annual Planning Costs",null,null,{"$f":"2728","v":2728},0,0,0,0,{"$f":"SUM(F15:J15)","v":2728}]
[null,2,"PEI Evaluation Costs",null,null,13992,0,0,0,0,{"$f":"SUM(F16:J16)","v":13992}]
[null,3,"PEI Administration Costs",null,null,{"$f":"80882.89","v":80882.89},0,0,0,0,80882.89]
[null,4,"PEI Funds Expended by CalMHSA for PEI SW ",null,null,18017,null,null,null,null,18017]
[null,5,"PEI Funds Transferred to JPA",null,null,0,null,null,null,null,0]
[null,6,"PEI Expenditure Incurred by JPA",null,null,0,null,null,null,null,0]
{"$rows_left_out":114}
{"sheet":"5. INN","index":5,"n_rows":132,"n_cols":16,"rows_kept":132,"cut":false,"hidden":false,"merged":[]}
[null,"STATE OF CALIFORNIA"]
[null,"HEALTH AND HUMAN SERVICES AGENCY"]
[]
[null,"DHCS 1822 E (Rev. 10/18)"]
[null,{"$f":"'1. Information'!B5","v":"Annual Mental Health Services Act Revenue and Expenditure Report"}]
[null,{"$f":"'1. Information'!B6","v":"Fiscal Year: 2022-23"}]
[null,"Innovation (INN) Summary"]
[]
[null,"County:",null,{"$f":"IF(ISBLANK('1. Information'!D11),\"\",'1. Information'!D11)","v":"San Benito"},null,"Date:",{"$f":"IF(ISBLANK('1. Information'!D9),\"\",'1. Information'!D9)","v":"2024-03-07"}]
[]
[null,"SECTION ONE"]
[]
[null,null,null,null,null,"A","B","C","D","E","F"]
[null,null,null,null,null,"Total MHSA (Including Interest)","Medi-Cal FFP","1991 Realignment","Behavioral Health Subaccount","Other","Grand Total"]
[null,1,"INN Annual Planning Costs",null,null,172,0,0,0,0,{"$f":"SUM(F15:J15)","v":172}]
[null,2,"INN Indirect Administration",null,null,46434.12,0,0,0,0,46434.12]
[null,3,"INN Funds Transferred to JPA",null,null,null,null,null,null,null,0]
[null,4,"INN Expenditure Incurred by JPA",null,null,null,null,null,null,null,0]
[null,5,"INN Project Administration",null,null,{"$f":"SUMIF($J$29:$J$132,\"Project Administration\",K$29:K$132)","v":0},{"$f":"SUMIF($J$29:$J$132,\"Project Administration\",L$29:L$132)","v":0},{"$f":"SUMIF($J$29:$J$132,\"Project Administration\",M$29:M$132)","v":0},{"$f":"SUMIF($J$29:$J$132,\"Project Administration\",N$29:N$132)","v":0},{"$f":"SUMIF($J$29:$J$132,\"Project Administration\",O$29:O$132)","v":0},0]
[null,6,"INN Project Evaluation",null,null,{"$f":"SUMIF($J$29:$J$132,\"Project Evaluation\",K$29:K$132)","v":2552},{"$f":"SUMIF($J$29:$J$132,\"Project Evaluation\",L$29:L$132)","v":0},{"$f":"SUMIF($J$29:$J$132,\"Project Evaluation\",M$29:M$132)","v":0},{"$f":"SUMIF($J$29:$J$132,\"Project Evaluation\",N$29:N$132)","v":0},{"$f":"SUMIF($J$29:$J$132,\"Project Evaluation\",O$29:O$132)","v":0},2552]
{"$rows_left_out":113}
{"sheet":"6. WET","index":6,"n_rows":33,"n_cols":11,"rows_kept":33,"cut":false,"hidden":false,"merged":[]}
[null,"STATE OF CALIFORNIA",null,null,null,null,null,null,null,null,"Department of Health Care Services"]
[null,"HEALTH AND HUMAN SERVICES AGENCY"]
[]
[null,"DHCS 1822 F (Rev. 10/18)"]
[null,{"$f":"'1. Information'!B5","v":"Annual Mental Health Services Act Revenue and Expenditure Report"}]
[null,{"$f":"'1. Information'!B6","v":"Fiscal Year: 2022-23"}]
[null,"Workforce Education and Training (WET) Summary"]
[]
[null,null,"County:",{"$f":"IF(ISBLANK('1. Information'!D11),\"\",'1. Information'!D11)","v":"San Benito"},null,"Date:",{"$f":"IF(ISBLANK('1. Information'!D9),\"\",'1. Information'!D9)","v":"2024-03-07"}]
[]
[null,"SECTION ONE"]
[]
[null,null,null,null,null,"A","B","C","D","E","F"]
[null,null,null,null,null,"Total MHSA (Including Interest)","Medi-Cal FFP","1991 Realignment","Behavioral Health Subaccount","Other","Grand Total"]
[null,1,"WET Annual Planning Costs",null,null,9137,0,0,0,0,{"$f":"SUM(F15:J15)","v":9137}]
[null,2,"WET Evaluation Costs",null,null,null,0,0,0,0,0]
[null,3,"WET Administration Costs",null,null,12022.86,0,0,0,0,12022.86]
[null,4,"WET Funds Transferred to JPA",null,null,0,null,null,null,null,0]
[null,5,"WET Expenditure Incurred by JPA",null,null,0,null,null,null,null,0]
[null,6,"WET Program Expenditures",null,null,{"$f":"SUM(E28:E32)","v":81417.84},{"$f":"SUM(F28:F32)","v":0},{"$f":"SUM(G28:G32)","v":0},{"$f":"SUM(H28:H32)","v":0},{"$f":"SUM(I28:I32)","v":0},81417.84]
{"$rows_left_out":14}
{"sheet":"7. CFTN","index":7,"n_rows":47,"n_cols":12,"rows_kept":47,"cut":false,"hidden":false,"merged":[]}
[null,"STATE OF CALIFORNIA",null,null,null,null,null,null,null,null,null,"Department of Health Care Services"]
[null,"HEALTH AND HUMAN SERVICES AGENCY"]
[]
[null,"DHCS 1822 G (Rev. 10/18)"]
[null,{"$f":"'1. Information'!B5","v":"Annual Mental Health Services Act Revenue and Expenditure Report"}]
[null,{"$f":"'1. Information'!B6","v":"Fiscal Year: 2022-23"}]
[null,"Capital Facility Technological Needs (CFTN) Summary"]
[]
[null,"County:",null,{"$f":"IF(ISBLANK('1. Information'!D11),\"\",'1. Information'!D11)","v":"San Benito"},null,"Date:",{"$f":"IF(ISBLANK('1. Information'!D9),\"\",'1. Information'!D9)","v":"2024-03-07"}]
[]
[null,"SECTION ONE"]
[]
[null,null,null,null,null,"A","B","C","D","E","F"]
[null,null,null,null,null,"Total MHSA (Including Interest)","Medi-Cal FFP","1991 Realignment","Behavioral Health Subaccount","Other","Grand Total"]
[null,1,"CF Annual Planning Costs",null,null,0,0,0,0,0,{"$f":"SUM(F15:J15)","v":0}]
[null,2,"TN Annual Planning Costs",null,null,0,0,0,0,0,{"$f":"SUM(F16:J16)","v":0}]
[null,3,"CF Evaluation Costs",null,null,0,0,0,0,0,0]
[null,4,"TN Evaluation Costs",null,null,0,0,0,0,0,0]
[null,5,"CF Administration",null,null,153842.32999999999,0,0,0,0,153842.32999999999]
[null,6,"TN Administration",null,null,0,0,0,0,0,0]
{"$rows_left_out":28}
{"sheet":"8. Adjustment (MHSA)","index":8,"n_rows":114,"n_cols":7,"rows_kept":114,"cut":false,"hidden":false,"merged":[]}
[null,"STATE OF CALIFORNIA",null,null,null,null,"Department of Health Care Services"]
[null,"HEALTH AND HUMAN SERVICES AGENCY"]
[]
[null,"DHCS 1822 H (Rev. 10/18)"]
[null,{"$f":"'1. Information'!B5","v":"Annual Mental Health Services Act Revenue and Expenditure Report"}]
[null,{"$f":"'1. Information'!B6","v":"Fiscal Year: 2022-23"}]
[null,"Adjustments Worksheet (MHSA)"]
[]
[null,"County:",null,{"$f":"IF(ISBLANK('1. Information'!D11),\"\",'1. Information'!D11)","v":"San Benito"},null,"Date",{"$f":"IF(ISBLANK('1. Information'!D9),\"\",'1. Information'!D9)","v":"2024-03-07"}]
[]
[null,"SECTION ONE"]
[]
[null,null,"A","B","C","D","E"]
[null,"#","County","Component","Adjustment to FY","Amount","Reason"]
[null,1,{"$f":"IF(F15<>0,VLOOKUP($D$9,Info_County_Code,2,FALSE),\"\")","v":""}]
[null,2,""]
[null,3,""]
[null,4,""]
[null,5,""]
[null,6,""]
{"$rows_left_out":95}
{"sheet":"9. Adjustment (FFP)","index":9,"n_rows":54,"n_cols":9,"rows_kept":54,"cut":false,"hidden":false,"merged":[]}
[null,"STATE OF CALIFORNIA",null,null,null,null,null,null,"Department of Health Care Services"]
[null,"HEALTH AND HUMAN SERVICES AGENCY"]
[]
[null,"DHCS 1822 I (Rev. 10/18)"]
[null,{"$f":"'1. Information'!B5","v":"Annual Mental Health Services Act Revenue and Expenditure Report"}]
[null,{"$f":"'1. Information'!B6","v":"Fiscal Year: 2022-23"}]
[null,"FFP Revenue Adjustment"]
[]
[null,"County:",null,{"$f":"IF(ISBLANK('1. Information'!D11),\"\",'1. Information'!D11)","v":"San Benito"},null,"Date:",{"$f":"IF(ISBLANK('1. Information'!D9),\"\",'1. Information'!D9)","v":"2024-03-07"}]
[]
[null,"SECTION ONE"]
[]
[null,null,"A","B","C","D","E","F","G"]
[null,"#","County","Fiscal Year","Cost Report Stage","Component","Beginning Balance","Adjustment Amount","Ending Balance"]
[null,1,{"$f":"IF(I15<>0,VLOOKUP($D$9,Info_County_Code,2,FALSE),\"\")","v":""},null,null,null,null,null,{"$f":"SUM(G15:H15)","v":0}]
[null,2,"",null,null,null,null,null,{"$f":"SUM(G16:H16)","v":0}]
[null,3,"",null,null,null,null,null,0]
[null,4,"",null,null,null,null,null,0]
[null,5,"",null,null,null,null,null,0]
[null,6,"",null,null,null,null,null,0]
{"$rows_left_out":35}
{"sheet":"10. Comments","index":10,"n_rows":51,"n_cols":6,"rows_kept":51,"cut":false,"hidden":false,"merged":[]}
[null,"STATE OF CALIFORNIA",null,null,null,"Department of Health Care Services"]
[null,"HEALTH AND HUMAN SERVICES AGENCY"]
[]
[null,"DHCS 1822 J (Rev. 10/18)"]
[null,{"$f":"'1. Information'!B5","v":"Annual Mental Health Services Act Revenue and Expenditure Report"}]
[null,{"$f":"'1. Information'!B6","v":"Fiscal Year: 2022-23"}]
[null,"Comments"]
[]
[null,"County:",{"$f":"IF(ISBLANK('1. Information'!D11),\"\",'1. Information'!D11)","v":"San Benito"},null,"Date:",{"$f":"IF(ISBLANK('1. Information'!D9),\"\",'1. Information'!D9)","v":"2024-03-07"}]
[]
[null,null,"Component","Comments"]
[null,1]
[null,2]
[null,3]
[null,4]
[null,5]
[null,6]
[null,7]
[null,8]
[null,9]
{"$rows_left_out":32}
{"sheet":"Checks","index":11,"n_rows":64,"n_cols":9,"rows_kept":64,"cut":false,"hidden":true,"merged":[]}
["SCO Distribution"]
["FY 2017-18"]
[null,null,"Total x 76%","Total x 19%","Total x 5%",null,"County Check:",{"$f":"'1. Information'!D11","v":"San Benito"}]
["County","TOTAL","CSS","PEI","INN"]
["Alameda",70551654.329999998,{"$f":"B5*0.76","v":53619257.290799998},{"$f":"B5*0.19","v":13404814.322699999},{"$f":"B5*0.05","v":3527582.7165000001},null,"Cell","Status","Notes"]
["Alpine",1499512.8499999999,{"$f":"B6*0.76","v":1139629.7659999998},{"$f":"B6*0.19","v":284907.44149999996},{"$f":"B6*0.05","v":74975.642500000002},null,"='2. Component Summary'!I24",{"$f":"IF(SUM('2. Component Summary'!D27:H27)='2. Component Summary'!I27,\"OK\",\"ERROR\")","v":"OK"},"CSS Transfers to PEI, WET, CFTN, or Prudent Reserve must net to total 0"]
["Amador",2931915.6899999995,2228255.9243999994,557063.98109999986,146595.78449999998,null,"='2. Component Summary'!D37",{"$f":"IF('2. Component Summary'!D40*0.05>VLOOKUP(H3,SCO_Distribution,2,FALSE),\"ERROR\",\"OK\")","v":"OK"},"Total MHSA costs for planning for all components may not exceed 5 percent of the total annual MHSA revenues received by the County."]
["Berkeley",5994545.0099999988,4555854.2075999994,1138963.5518999998,299727.25049999997,null,"='2. Component Summary'!D43",{"$f":"IF(ISBLANK('2. Component Summary'!D46),\"ERROR\",\"OK\")","v":"OK"},"Counties must report total MHSA funds spent on mental health services provided to veterans for all programs and projects funded through the Community Services and Supports, Prevention and Early Intervention, and Innovation components, combined. ENTER $0 IF NO SPENDING."]
["Butte",11405471.799999999,8668158.568,2167039.642,570273.59,null,"='2. Component Summary'!G12",{"$f":"IF(ISBLANK('2. Component Summary'!I14),\"ERROR\",\"OK\")","v":"OK"},"Counties must report the total amount of interest earned on the local MHS fund"]
["Calaveras",3208867.31,2438739.1556000002,609684.78890000004,160443.36550000001,null,"='2. Component Summary'!F16",{"$f":"IF(ISBLANK('2. Component Summary'!F19),\"ERROR\",\"OK\")","v":"OK"},"Please report the beginning balance of the local prudent reserve. This amount must match the prudent reserve ending balance reported in the FY 2016-17 ARER"]
["Colusa",2568596.2199999997,1952133.1271999998,488033.28179999994,128429.81099999999]
["Contra Costa",45360350.140000008,34473866.106400006,8618466.5266000014,2268017.5070000007]
["Del Norte",2728833.71,2073913.6196000001,518478.40490000002,136441.68549999999]
["El Dorado",7928641.3099999987,6025767.3955999995,1506441.8488999999,396432.06549999997]
["Fresno",49459289.239999995,37589059.822399996,9397264.9555999991,2472964.4619999998]
["Glenn",2777161.3,2110642.588,527660.647,138858.065]
["Humboldt",7058805.6600000011,5364692.3016000008,1341173.0754000002,352940.28300000005]
["Imperial",9759832.0800000001,7417472.3808000004,1854368.0952000001,487991.60400000005]
["Inyo",1843374.33,1400964.4908,350241.12270000001,92168.71650000001]
["Kern",42775932.490000002,32509708.692400001,8127427.1731000002,2138796.6245000004]
{"$rows_left_out":45}
{"sheet":"drop down fields","index":12,"n_rows":60,"n_cols":14,"rows_kept":60,"cut":false,"hidden":true,"merged":[[0,0,0,1]]}
["Info_County_Code",null,"Info_Population","CSS_Service_Category","PEI_Combined_Standalone","PEI_Program_Type","INN_Expenditure_Type","WET_Funding_Category","CFTN_Project_Type","Adjustment_MHSA_Component","MHSA_Adjustment_FY","FFP_Adjustment_FY","Adjustment_Reason","Cost_Report_Stage"]
["Alameda",1,"Yes","FSP","Combined","Prevention","Project","Workforce Staffing","Capital Facility","CSS","FY 2015-16","FY 2009-10","Cost Report Reconciliation","Audited"]
["Alpine",2,"No","Non-FSP","Standalone","Early Intervention","Project Administration","Training/Technical Assistance","Technological Need","PEI","FY 2016-17","FY 2010-11","Cost Report Audit","Settled"]
["Amador",3,null,null,null,"Outreach","Project Evaluation","MH Career Pathways",null,"INN",null,"FY 2011-12","SDMC Chart Audit","Initial"]
["Berkeley City",65,null,null,null,"Stigma & Discrimination Reduction",null,"Residency/Internship",null,"WET",null,"FY 2012-13","Local Quality Assurance Audit"]
["Butte",4,null,null,null,"Suicide Prevention",null,"Financial Incentive",null,"CFTN",null,"FY 2013-14","Error"]
["Calaveras",5,null,null,null,"Access and Linkage",null,null,null,"WET RP",null,"FY 2014-15","Other"]
["Colusa",6,null,null,null,"Improving Timely Access",null,null,null,"PEI SW",null,"FY 2015-16"]
["Contra Costa",7,null,null,null,"Combined Summary",null,null,null,"MHSA HP",null,"FY 2016-17"]
["Del Norte",8,null,null,null,null,null,null,null,"Prudent Reserve"]
["El Dorado",9]
["Fresno",10]
["Glenn",11]
["Humboldt",12]
["Imperial",13]
["Inyo",14]
["Kern",15]
["Kings",16]
["Lake",17]
["Lassen",18]
{"$rows_left_out":41}
{"sheet":"E-1 CountyState2017","index":13,"n_rows":83,"n_cols":5,"rows_kept":83,"cut":false,"hidden":true,"merged":[[4,1,4,2],[1,0,1,4],[2,0,2,4]]}
[null,null,null,"About the Data"]
["E-1: State/County Population Estimates with Annual Percent Change"]
["January 1, 2017 and 2018"]
[]
["State/County","           Total Population",null,"Percent"]
[null,"2017-01-01","2018-01-01","Change","County Population:  Over 200,000? (Yes or No)"]
[]
["California",39500973,39809693,0.8]
[]
["Alameda",1646405,1660202,0.8,{"$f":"IF(B10>=200000,\"Yes\", \"No\")","v":"Yes"}]
["Alpine",1156,1154,-0.2,{"$f":"IF(B11>=200000,\"Yes\", \"No\")","v":"No"}]
["Amador",38382,38094,-0.8,"No"]
["Butte",226403,227621,0.5,"Yes"]
["Calaveras",45175,45157,0,"No"]
["Colusa",22050,22098,0.2,"No"]
["Contra Costa",1139313,1149363,0.9,"Yes"]
["Del Norte",27060,27221,0.6,"No"]
["El Dorado",186223,188399,1.2,"No"]
["Fresno",995233,1007229,1.2,"Yes"]
["Glenn",28730,28796,0.2,"No"]
{"$rows_left_out":63}